{"text_format":"1","workbook":"xlsx","n_sheets":2,"sheets":["Form","data"],"not_rendered":{"charts":0,"images":0,"macros":1,"external_links":0,"defined_names":1,"comments":0,"pivot_tables":0},"unopened":[],"bounds":{"document_bytes":16777216,"sheet_cells":100000,"rows_first":2000,"rows_last":500,"rows_between":2000,"halvings":0,"cell_chars":16384,"cell_head_chars":4096},"cells_cut":0,"cells_raw":0,"read":"whole","date_system":"1900"}

{"sheet":"Form","index":0,"n_rows":38,"n_cols":12,"rows_kept":38,"cut":false,"hidden":false,"merged":[[0,1,0,11],[1,1,1,11],[3,3,3,5]]}
[null,"University of Notre Dame"]
[null,"Pooled Position Request Form"]
[]
[null,"Requestor's Name"]
[]
[]
[]
[]
[]
[]
["Request 1","Home Org"]
[null,"Position Type (Select One)"]
[null,null,null,null,null,null,null,null,null,"Fringe  ","Fringe  "]
[null,null,null,"Fund","Org","Account","Program","Activity","Salary","Rate","Dollars","Total"]
[null,"Labor Distribution",null,null,null,{"$f":"IFERROR(VLOOKUP(D12,data!$B$4:$C$14,2,FALSE),\"\")","v":""},null,null,null,{"$f":"IFERROR(VLOOKUP(D12,data!$B$4:$D$14,3,FALSE),\"\")","v":""},{"$f":"IFERROR(+I15*J15,\"\")","v":""},{"$f":"IFERROR(+I15+K15,\"\")","v":""}]
[]
["Request 2","Home Org"]
[null,"Position Type (Select One)"]
[null,null,null,null,null,null,null,null,null,"Fringe  ","Fringe  "]
[null,null,null,"Fund","Org","Account","Program","Activity","Salary","Rate","Dollars","Total"]
[null,"Labor Distribution",null,null,null,{"$f":"IFERROR(VLOOKUP(D18,data!$B$4:$C$14,2,FALSE),\"\")","v":""},null,null,null,{"$f":"IFERROR(VLOOKUP(D18,data!$B$4:$D$14,3,FALSE),\"\")","v":""},{"$f":"IFERROR(+I21*J21,\"\")","v":""},{"$f":"IFERROR(+I21+K21,\"\")","v":""}]
[]
["Request 3","Home Org"]
[null,"Position Type (Select One)"]
[null,null,null,null,null,null,null,null,null,"Fringe  ","Fringe  "]
[null,null,null,"Fund","Org","Account","Program","Activity","Salary","Rate","Dollars","Total"]
[null,"Labor Distribution",null,null,null,{"$f":"IFERROR(VLOOKUP(D24,data!$B$4:$C$14,2,FALSE),\"\")","v":""},null,null,null,{"$f":"IFERROR(VLOOKUP(D24,data!$B$4:$D$14,3,FALSE),\"\")","v":""},{"$f":"IFERROR(+I27*J27,\"\")","v":""},{"$f":"IFERROR(+I27+K27,\"\")","v":""}]
[]
[]
[null,"Additional Notes or Descriptions:"]
[]
[]
[]
[]
[]
[]
[]
[null,"Please send completed form to the Budget Office at position@nd.edu"]

{"sheet":"data","index":1,"n_rows":14,"n_cols":4,"rows_kept":14,"cut":false,"hidden":false,"merged":[]}
[]
[]
[null,"E-class","Account","Fringe"]
[null,"Select One"]
[null,"T1 - NE Temp/On-Call Hourly",64035,7.3999999999999996E-2]
[null,"P1 - FT Post Doc",62010,0.24399999999999999]
[null,"P2 - PT Post Doc",62020,7.3999999999999996E-2]
[null,"G1 - Graduate Stipend",63020,0.10299999999999999]
[null,"G2 - Graduate Hourly",63010,0.10299999999999999]
[null,"U1 - Undergrad Stipend",63030,1.7000000000000001E-2]
[null,"U2 - Student Hourly",63030,1.7000000000000001E-2]
[null,"F3 - PT Non-Reg Faculty 12/12",61004,7.3999999999999996E-2]
[null,"F4 - FT Non-Reg Visiting Faculty 12/12",61004,0.24399999999999999]
[null,"F7 - PT Non-Reg Visiting Faculty 12/12",61004,7.3999999999999996E-2]